Here is a summary of the FreeBSD Continuous Integration results for the period
from 2020-03-16 to 2020-03-22.
During this period, we have:
Test case status (on 2020-03-22 23:59):
Branch/Architecture | Total | Pass | Fail | Skipped |
---|---|---|---|---|
head/amd64 | 7722 (+1) | 7625 (+1) | 0 (0) | 97 (0) |
head/i386 | 7720 (+1) | 7614 (+1) | 0 (0) | 106 (0) |
12-STABLE/amd64 | 7506 (0) | 7453 (0) | 0 (0) | 53 (0) |
12-STABLE/i386 | 7504 (0) | 7440 (-3) | 0 (0) | 64 (+3) |
11-STABLE/amd64 | 6880 (0) | 6833 (0) | 0 (0) | 47 (0) |
11-STABLE/i386 | 6878 (0) | 6826 (0) | 0 (0) | 52 (0) |
(The statistics from experimental jobs are omitted)
If any of the issues found by CI are in your area of interest or expertise
please investigate the PRs listed below.
The latest web version of this report is available at
https://hackmd.io/@FreeBSD-CI/report-20200322 and archive is available at
https://hackmd.io/@FreeBSD-CI/ , any help is welcome.
https://ci.freebsd.org/job/FreeBSD-head-mips64-build
This error was encountered when this job was using devel/gcc6@mips64 port (mips64-gcc6 pacakge)
This job was switched to use clang/lld on 2020-03-24. Gcc job will be added later.
===> include/rpcsvc (includes)
RPCGEN_CPP=/usr/local/bin/mips64-unknown-freebsd12.0-cpp6\ --sysroot=/usr/home/lwhsu/freebsd-obj-gcc6/usr/home/lwhsu/freebsd-src/mips.mips64/tmp\ -B/usr/local/mips64-unknown-freebsd12.0/bin/ rpcgen -C -h -DWANT_NFS3 /usr/home/lwhsu/freebsd-src/include/rpcsvc/mount.x -o mount.h
/usr/home/lwhsu/freebsd-src/include/rpcsvc/mount.x:1:0: error: '-march=mips1' is not compatible with the selected ABI
/*-
*** [mount.h] Error code 1
make[4]: stopped in /usr/home/lwhsu/freebsd-src/include/rpcsvc
1 error
https://ci.freebsd.org/job/FreeBSD-head-amd64-gcc6_build/
--- all_subdir_usr.bin/clang/lldb ---
/usr/local/bin/x86_64-unknown-freebsd12.1-ld: /tmp/obj/workspace/src/amd64.amd64/lib/clang/liblldb/liblldb.a(IOHandler.o): in function `curses::Window::Box(unsigned int, unsigned int)':
/workspace/src/contrib/llvm-project/lldb/source/Core/IOHandler.cpp:926: undefined reference to `box'
/usr/local/bin/x86_64-unknown-freebsd12.1-ld: /workspace/src/contrib/llvm-project/lldb/source/Core/IOHandler.cpp:926: undefined reference to `box'
collect2: error: ld returned 1 exit status
3 tests start failing after llvm10 import
fusefs tests fail when mac_bsdextended.ko is loaded
https://bugs.freebsd.org/244229
dtrace -c
causes program dumps core after somewhere between (r357694, r357701]
https://bugs.freebsd.org/244053
Lock-order reversals triggered by tests under sys.net.if_lagg_test.* on i386
https://bugs.freebsd.org/244163
Discovered by newly endabled sys.net.* tests. (r357857)
sys.net.if_lagg_test.lacp_linkstate_destroy_stress panics i386 kernel
https://bugs.freebsd.org/244168
Discovered by newly endabled sys.net.* tests. (r357857)
(test case) sys.geom.class.multipath.misc.fail_on_error (on 12-STABLE)
https://bugs.freebsd.org/244158
https://ci.freebsd.org/job/FreeBSD-head-amd64-dtrace_test/
https://ci.freebsd.org/job/FreeBSD-head-amd64-test_zfs/
https://ci.freebsd.org/job/FreeBSD-head-amd64-test_ltp/